Home > Sc Error > Sc Error Code 1639

Sc Error Code 1639

Reload to refresh your session. type= (default = own) start= (default = demand) error= (default = normal) binPath= group= tag= depend= obj= (default = OPTIONS: NOTE: The option name includes the equal sign. Is this normal? http://softbb.net/sc-error/could-not-install-eset-installer-on-target-computer-sc-error-code-11-gle-error-code-1460.html

Error 11:02:28 Script 'C:\Program Files\JCI\MEMDataCollector\Octopus.Features.WindowsService_BeforePostDeploy.ps1' returned non-zero exit code: 1 Error 11:02:28 The remote script failed with exit code 1 I have seen this error in an earlier issue on this sc.exe create {redacted} binPath= "C:\services\{redacted}.exe -{redacted}" DisplayName= "{redacted}" depend= / start= delayed-auto obj= {redacted} password= "************" DESCRIPTION: Creates a service entry in the registry and Service Database. ERROR_INSTALL_LANGUAGE_UNSUPPORTED1623This language of this installation package is not supported by your system. Available beginning with Windows Installer version 3.0. http://stackoverflow.com/questions/5600259/sc-exe-fails-with-a-1639

The system will be restarted so the changes can take effect. ERROR_PATCH_TARGET_NOT_FOUND 1642 (0x66A) The upgrade cannot be installed by the Windows Installer service because the program to be upgraded Available beginning with Windows Installer version 3.0. Contact the application vendor to verify that this is a valid Windows Installer package. ERROR_INSTALL_UI_FAILURE 1621 (0x655) There was an error starting the Windows Installer service user interface.

Reload to refresh your session. Also since it sounds like you may be using a command line and switches to install the client, what are you entering? This documentation is archived and is not being maintained. Notepad locks it so nothing new will show, but it will still be written just need to reopen the log.

MsiExec.exe and InstMsi.exe Error Messages These error codes are returned by the Windows Installer functions MsiExec.exe and InstMsi.exe. Available beginning with Windows Installer version 3.0. Contact your support personnel. ERROR_INSTALL_TEMP_UNWRITABLE 1632 (0x660) The Temp folder is on a drive that is full or is inaccessible. https://github.com/OctopusDeploy/Issues/issues/1787 Please try the request again.

It will help out a lot looking at the logs. ERROR_INSTALL_TRANSFORM_FAILURE1624There was an error applying transforms. A space is required between the equal sign and the value. Due to this machine being off SCCM, it didn't receive the last McAfee update, which I believe actually stops such issues from occuring.

The folder name is "ConfigMgr 2007 Toolkit" and the file you would want is CcmTools.msi. regards, Jörgen -- My System Center blog ccmexec.com -- Twitter @ccmexec Wednesday, August 15, 2012 3:31 PM Reply | Quote Moderator 0 Sign in to vote Thanks for the responses :-) ERROR_INSTALL_LOG_FAILURE1622There was an error opening installation log file. Installation of this version cannot continue.

ERROR_DATATYPE_MISMATCH1629The data supplied is the wrong type. this contact form ERROR_INVALID_COMMAND_LINE1639Invalid command line argument. Contact the application vendor to verify that this is a valid Windows Installer update package. ERROR_PATCH_PACKAGE_UNSUPPORTED 1637 (0x665) This update package cannot be processed by the Windows Installer service. Close and reopen the log with notepad and the jibberish should be there.

The value provided for the new password does not meet the length, complexity, or history requirements of the domain. ERROR_LOGON_FAILURE 1326 (0x52E) The user name or password is incorrect. How are you looking at the log? ERROR_FUNCTION_FAILED1627The function failed during execution. http://softbb.net/sc-error/could-not-install-eset-installer-on-target-computer-sc-error-code-11-gle-error-code-5.html Would England of the 14th Century be capable of producing revolver bullets What mechanical effects would the common cold have?

They are returned by the GetLastError function when many functions fail. You must install a Windows service pack that contains a newer version of the Windows Installer service. ERROR_PRODUCT_VERSION 1638 (0x666) Another version of this product is already installed. Contact your support personnel.

You signed in with another tab or window.

Been tearing my hair out trying to get it working! :-) Thanks for looking at this! TV episode or movie where people on planet only live a hundred days and fall asleep at prescribed time Word that includes "food, alcoholic drinks, and non-alcoholic drinks"? Yes No Additional feedback? 1500 characters remaining Submit Skip this Thank you! Generated Tue, 06 Dec 2016 14:52:03 GMT by s_ac16 (squid/3.5.20)

Simon Xt Error Sn Exists Simon XT talking remote touchpad - … – Just got this from my Front Point rep, I think alot of people have been waiting on this. ERROR_INVALID_DATA13The data is invalid. The ccmsetup.log should have written something though. http://softbb.net/sc-error/sc-error-code-6-gle-error-code-1203.html ERROR_PATCH_PACKAGE_OPEN_FAILED1635This patch package could not be opened.

Installation will proceed with no transformation.]LOG]!>

Requirements Minimum supported client Windows XP [desktop apps only] Minimum supported server Windows Server 2003 [desktop apps only] Header WinError.h See also System Error Codes     Show: Inherited Protected Print Export (0) ERROR_BAD_CONFIGURATION1610The configuration data for this product is corrupt. I know which site it should belong to =-/ Edit: Okay, now we're rolling! I didn't have this error in 2.5.x.

Mike michaelnoonan added ready bug Calamari priority in progress and removed ready labels Jul 28, 2015 michaelnoonan self-assigned this Jul 28, 2015 michaelnoonan added a commit to OctopusDeploy/Calamari that closed this Consult the Windows Installer SDK for detailed command line help. ERROR_PATCH_PACKAGE_REJECTED1643The patch package is not permitted by system policy. Contact your product vendor. ERROR_INSTALL_NOTUSED 1634 (0x662) Component not used on this computer. ERROR_PATCH_PACKAGE_OPEN_FAILED 1635 (0x663) This update package could not be opened.

ERROR_INSTALL_TRANSFORM_REJECTED1644One or more customizations are not permitted by system policy. The System Error Codes are very broad. What does "put on one's hat" mean? Verify that the package exists and that you can access it, or contact the application vendor to verify that this is a valid Windows Installer package. ERROR_INSTALL_PACKAGE_INVALID 1620 (0x654) This

share|improve this answer answered Apr 8 '11 at 21:06 amber 44511331 add a comment| Your Answer draft saved draft discarded Sign up or log in Sign up using Google Sign